Image 01
profile-image

seqizz

Gürkan Gür Adana, Turkey
KDE 4 Splashscreens
KDM4 Themes
Bootsplash Various
Scale Up

Various KDE 1.-4. Improvements 7 comments

Score 72.2%
Apr 14 2010
doesn't compile in kde 4.7:


[ 80%] [100%] Building CXX object CMakeFiles/kcm_kwin4_effect_scaleup.dir/kcm_kwin4_effect_scaleup_automoc.o
Building CXX object CMakeFiles/kcm_kwin4_effect_scaleup.dir/scaleup_config.o
In file included from /tmp/yaourt-tmp-root/aur-kwin-effect-scaleout-git/src/kwin-effect-scaleout/scaleup.cpp:18:0:
/tmp/yaourt-tmp-root/aur-kwin-effect-scaleout-git/src/kwin-effect-scaleout/scaleup.h:41:37: error: ‘TimeLine’ was not declared in this scope
/tmp/yaourt-tmp-root/aur-kwin-effect-scaleout-git/src/kwin-effect-scaleout/scaleup.h:41:46: error: template argument 2 is invalid
/tmp/yaourt-tmp-root/aur-kwin-effect-scaleout-git/src/kwin-effect-scaleout/scaleup.cpp: In member function ‘virtual void KWin::ScaleUpEffect::reconfigure(KWin::Effect::ReconfigureFlags)’:
/tmp/yaourt-tmp-root/aur-kwin-effect-scaleout-git/src/kwin-effect-scaleout/scaleup.cpp:32:18: error: variable ‘KConfigGroup conf’ has initializer but incomplete type
/tmp/yaourt-tmp-root/aur-kwin-effect-scaleout-git/src/kwin-effect-scaleout/scaleup.cpp:32:63: error: invalid use of incomplete type ‘struct KConfigGroup’
/usr/include/kconfigbase.h:32:7: error: forward declaration of ‘struct KConfigGroup’
/tmp/yaourt-tmp-root/aur-kwin-effect-scaleout-git/src/kwin-effect-scaleout/scaleup.cpp: In member function ‘virtual void KWin::ScaleUpEffect::prePaintScreen(KWin::ScreenPrePaintData&, int)’:
/tmp/yaourt-tmp-root/aur-kwin-effect-scaleout-git/src/kwin-effect-scaleout/scaleup.cpp:41:27: error: request for member ‘isEmpty’ in ‘((KWin::ScaleUpEffect*)this)->KWin::ScaleUpEffect::mTimeLineWindows’, which is of non-class type ‘int’
/tmp/yaourt-tmp-root/aur-kwin-effect-scaleout-git/src/kwin-effect-scaleout/scaleup.cpp: In member function ‘virtual void KWin::ScaleUpEffect::prePaintWindow(KWin::EffectWindow*, KWin::WindowPrePaintData&, int)’:
/tmp/yaourt-tmp-root/aur-kwin-effect-scaleout-git/src/kwin-effect-scaleout/scaleup.cpp:48:26: error: request for member ‘contains’ in ‘((KWin::ScaleUpEffect*)this)->KWin::ScaleUpEffect::mTimeLineWindows’, which is of non-class type ‘int’
/tmp/yaourt-tmp-root/aur-kwin-effect-scaleout-git/src/kwin-effect-scaleout/scaleup.cpp:50:31: error: ‘class KWin::EffectWindow’ has no member named ‘addTime’
/tmp/yaourt-tmp-root/aur-kwin-effect-scaleout-git/src/kwin-effect-scaleout/scaleup.cpp:51:35: error: ‘class KWin::EffectWindow’ has no member named ‘value’
/tmp/yaourt-tmp-root/aur-kwin-effect-scaleout-git/src/kwin-effect-scaleout/scaleup.cpp:54:30: error: request for member ‘remove’ in ‘((KWin::ScaleUpEffect*)this)->KWin::ScaleUpEffect::mTimeLineWindows’, which is of non-class type ‘int’
/tmp/yaourt-tmp-root/aur-kwin-effect-scaleout-git/src/kwin-effect-scaleout/scaleup.cpp: In member function ‘virtual void KWin::ScaleUpEffect::paintWindow(KWin::EffectWindow*, int, QRegion, KWin::WindowPaintData&)’:
/tmp/yaourt-tmp-root/aur-kwin-effect-scaleout-git/src/kwin-effect-scaleout/scaleup.cpp:61:26: error: request for member ‘contains’ in ‘((KWin::ScaleUpEffect*)this)->KWin::ScaleUpEffect::mTimeLineWindows’, which is of non-class type ‘int’
/tmp/yaourt-tmp-root/aur-kwin-effect-scaleout-git/src/kwin-effect-scaleout/scaleup.cpp:66:50: error: ‘class KWin::EffectWindow’ has no member named ‘value’
/tmp/yaourt-tmp-root/aur-kwin-effect-scaleout-git/src/kwin-effect-scaleout/scaleup.cpp: In member function ‘virtual void KWin::ScaleUpEffect::postPaintWindow(KWin::EffectWindow*)’:
/tmp/yaourt-tmp-root/aur-kwin-effect-scaleout-git/src/kwin-effect-scaleout/scaleup.cpp:81:26: error: request for member ‘contains’ in ‘((KWin::ScaleUpEffect*)this)->KWin::ScaleUpEffect::mTimeLineWindows’, which is of non-class type ‘int’
/tmp/yaourt-tmp-root/aur-kwin-effect-scaleout-git/src/kwin-effect-scaleout/scaleup.cpp: In member function ‘virtual void KWin::ScaleUpEffect::windowUserMovedResized(KWin::EffectWindow*, bool, bool)’:
/tmp/yaourt-tmp-root/aur-kwin-effect-scaleout-git/src/kwin-effect-scaleout/scaleup.cpp:103:9: error: ‘TimeLine’ was not declared in this scope
/tmp/yaourt-tmp-root/aur-kwin-effect-scaleout-git/src/kwin-effect-scaleout/scaleup.cpp:103:19: error: ‘t’ was not declared in this scope
/tmp/yaourt-tmp-root/aur-kwin-effect-scaleout-git/src/kwin-effect-scaleout/scaleup.cpp:104:26: error: ‘TimeLine’ is not a class or namespace
/tmp/yaourt-tmp-root/aur-kwin-effect-scaleout-git/src/kwin-effect-scaleout/scaleup.cpp: In member function ‘virtual void KWin::ScaleUpEffect::windowClosed(KWin::EffectWindow*)’:
/tmp/yaourt-tmp-root/aur-kwin-effect-scaleout-git/src/kwin-effect-scaleout/scaleup.cpp:118:22: error: request for member ‘remove’ in ‘((KWin::ScaleUpEffect*)this)->KWin::ScaleUpEffect::mTimeLineWindows’, which is of non-class type ‘int’
make[2]: *** [CMakeFiles/kwin4_effect_scaleup.dir/scaleup.o] Error 1
make[1]: *** [CMakeFiles/kwin4_effect_scaleup.dir/all] Error 2
make[1]: *** Waiting for unfinished jobs....
- Aug 03 2011
Gentoo Logo Green KDM4

KDM4 Themes 4 comments

Score 80.6%
Feb 28 2011
sorry for little mistakes :P no time to edit :) - Mar 15 2011
Slim Glow

Plasma Themes 102 comments

Score 67.4%
Dec 31 2012
Because I don't want to emerge the whole package for 1 theme :)

[ebuild N ] kde-base/kdeartwork-desktopthemes-4.6.1
114,148 kB - Mar 05 2011
Quick Usb Formatter

System Software 32 comments

Score 84.8%
Oct 21 2011
Here is the tr.po,
Regards..

http://paste.pocoo.org/show/336661/ - Feb 11 2011
Automated Font Installer

Nautilus Scripts 19 comments

Score 46.0%
Jul 15 2009
# Turkish translation by Gürkan Gür (seqizz) #
##########################################################################
# Language Settings ---------------------------------------------------- #
wait='Yazıtipi öncelleği güncelleniyor, lütfen bekleyin'
title_wait='Bitiriliyor'

errors='Bir hata var'
title_errors='Hata'

# End of language settings ----------------------------------------------# - Jun 29 2008
KFaenza

Icon Themes
by snakebite

Score 81.0%
Sep 09 2011
Daisy

Plasma 4 Widgets
by Lechio

Score 81.9%
Aug 10 2011
Score 46.0%
3   Oct 18 2015
Score 70.9%
3   Sep 12 2014
KotenZA

Icon Themes
by pawanyadav

Score 82.1%
9   Jul 25 2013
Ponies Everywhere

Plasma 4 Widgets
by eyecreate

Score 67.3%
3   Sep 23 2011
Score 61.4%
3   Sep 09 2011
Score 46.0%
3   Aug 11 2011
krunner-googletranslate

Krunner Plugins
by tcat

Score 76.7%
9   Aug 09 2011
Night Sky

Wallpaper Other
by CharlieMAC

Score 53.3%
3   Aug 07 2011
Kopete login window

Desktop Concepts
by and1

Score 46.0%
3   Aug 04 2011
Score 53.3%
3   Aug 04 2011
Athkar

Plasma 4 Widgets
by Amine27

Score 63.8%
3   Aug 04 2011
Live Desktop

Screensavers
by copelandrc

Score 63.3%
9   Aug 04 2011
Active Application

Plasma 4 Widgets
by avlas

Score 77.8%
3   Aug 04 2011
Amarok

Audioplayers
by amarok

Score 77.0%
3   Aug 04 2011
BusyTasks

Plasma 4 Widgets
by unknownSpirit

Score 78.7%
9   Aug 04 2011
Androbit

Plasma Themes
by nameless89

Score 77.8%
3   Aug 03 2011
Fragile

Plasma Themes
by garthecho

Score 71.2%
3   Aug 03 2011
win-classic

Plasma Themes
by megabaks

Score 74.2%
3   Aug 03 2011
Titlebar menu

Various KDE 1.-4. Improvements
by johnnybravo

Score 80.0%
3   Aug 03 2011
One Pixel Title

Yakuake Skins
by aspotashev

Score 62.5%
3   Jul 24 2011
Score 67.1%
9   Jul 23 2011
Skulpture

Plasma Widget Styles
by skulptor

Score 77.8%
3   Jul 21 2011
KDE PO Thumbnailer

Various KDE 1.-4. Improvements
by nihui

Score 82.4%
9   Jul 08 2011
Blue Sora

Plasma Themes
by Deathmachine

Score 82.5%
3   Mar 23 2011